Passing force_secure and force_passive to delegatd GridFTP DMC.

2 jobs for closed-issue_13 in 51 minutes and 53 seconds (queued for 3 minutes and 32 seconds)
latest
Status Name Job ID Coverage
  Build
failed build_forks_deb9 #2658
general-shared

00:47:16

passed build_forks_el6 #2657
general-shared

00:30:44

 
Name Stage Failure
failed
build_forks_deb9 Build
make[2]: Leaving directory '/builds/aleksandr.konstantinov/arc/src'
Makefile:658: recipe for target 'check-recursive' failed
make[1]: Leaving directory '/builds/aleksandr.konstantinov/arc'
make[2]: *** [check-recursive] Error 1
make[1]: *** [check-recursive] Error 1
debian/rules:58: recipe for target 'build-stamp' failed
make: *** [build-stamp] Error 2
dpkg-buildpackage: error: debian/rules build gave error exit status 2
ERROR: Job failed: exit code 1