Fix for build on systems with openssl 1.1.0h

2 jobs for closed-build_fix_20180412 in 12 minutes and 3 seconds (queued for 56 minutes and 21 seconds)
latest
Status Name Job ID Coverage
  Rpms
failed make_rpms_el6 #2663
general-shared

00:05:08

failed make_rpms_el7 #2664
general-shared

00:06:55

 
Name Stage Failure
failed
make_rpms_el7 Rpms
make[1]: *** [all-recursive] Error 1
make[1]: Leaving directory `/builds/aleksandr.konstantinov/arc/rpmbuild/BUILD/nordugrid-arc-trunk'
make: *** [all] Error 2
error: Bad exit status from /var/tmp/rpm-tmp.e2JxcI (%build)
Bad exit status from /var/tmp/rpm-tmp.e2JxcI (%build)


RPM build errors:
ERROR: Job failed: exit code 1
failed
make_rpms_el6 Rpms
make[1]: *** [all-recursive] Error 1
make[1]: Leaving directory `/builds/aleksandr.konstantinov/arc/rpmbuild/BUILD/nordugrid-arc-trunk'
make: *** [all] Error 2
error: Bad exit status from /var/tmp/rpm-tmp.XLrEw5 (%build)
Bad exit status from /var/tmp/rpm-tmp.XLrEw5 (%build)


RPM build errors:
ERROR: Job failed: exit code 1