Merge branch 'master' into fragmented_control_dir

3 jobs for fragmented_control_dir in 105 minutes and 53 seconds (queued for 3 seconds)
latest
Status Job ID Name Coverage
  Build
failed #19626
build
fork_packages_deb9

00:33:28

failed #19624
build
fork_packages_el6

00:27:30

failed #19625
build
fork_packages_el7

00:44:55

 
Name Stage Failure
failed
fork_packages_deb9 Build There is an unknown failure, please try again
make[1]: Leaving directory '/builds/aleksandr.konstantinov/arc/nordugrid-arc-6.0.0'
debian/rules:62: recipe for target 'build-stamp' failed
make[4]: *** [all-recursive] Error 1
make[3]: *** [all-recursive] Error 1
make[2]: *** [all-recursive] Error 1
make[1]: *** [all] Error 2
make: *** [build-stamp] Error 2
dpkg-buildpackage: error: debian/rules build gave error exit status 2
ERROR: Job failed: exit code 1
failed
fork_packages_el7 Build There is an unknown failure, please try again
make[2]: Leaving directory `/builds/aleksandr.konstantinov/arc/rpmbuild/BUILD/nordugrid-arc-20191025T183616_c1db8634_master/src'
make[1]: Leaving directory `/builds/aleksandr.konstantinov/arc/rpmbuild/BUILD/nordugrid-arc-20191025T183616_c1db8634_master'
make: *** [all] Error 2
error: Bad exit status from /var/tmp/rpm-tmp.mn9LIl (%build)
Bad exit status from /var/tmp/rpm-tmp.mn9LIl (%build)


RPM build errors:
ERROR: Job failed: exit code 1
failed
fork_packages_el6 Build There is an unknown failure, please try again
make[1]: Leaving directory `/builds/aleksandr.konstantinov/arc/rpmbuild/BUILD/nordugrid-arc-20191025T180854_c1db8634_master'
make[1]: *** [all-recursive] Error 1
make: *** [all] Error 2
error: Bad exit status from /var/tmp/rpm-tmp.QIt61z (%build)
Bad exit status from /var/tmp/rpm-tmp.QIt61z (%build)


RPM build errors:
ERROR: Job failed: exit code 1